{"text_format":"1","workbook":"xlsx","n_sheets":7,"sheets":["ENTREE","Calcul (EF)","POST-TRAITEMENT & SORTIE","BASES","echangeurs","LISTES","ConditionsTests"],"not_rendered":{"charts":2,"images":3,"macros":1,"external_links":0,"defined_names":139,"comments":3,"pivot_tables":0},"unopened":[],"bounds":{"document_bytes":16777216,"sheet_cells":100000,"rows_first":2000,"rows_last":500,"rows_between":2000,"halvings":0,"cell_chars":16384,"cell_head_chars":4096},"cells_cut":0,"cells_raw":0,"read":"whole","date_system":"1900"}

{"sheet":"ENTREE","index":0,"n_rows":77,"n_cols":13,"rows_kept":77,"cut":false,"hidden":false,"merged":[[11,0,11,7],[5,0,5,7],[27,0,27,7],[0,0,0,7],[17,6,17,7],[18,6,18,7],[19,3,19,4],[23,3,23,4],[23,0,23,1],[19,0,19,1]]}
["Titre V : AmièsPAC"]
[]
["Légende :","A saisir"]
[null,"Calculé automatiquement"]
[]
["BATIMENT",null,null,null,null,null,null,null,null,"Données de calcul, pour information"]
[]
["Type de logement","Logements collectifs",null,"SHON",14592,null,"Zone géographique","H1a",null,"Qpr Ballon cogé - Par défaut (kWh/24h)",{"$f":"4.2*IF(BallonVH=\"NON\",70,60)*POWER(IF(AND(Nbr_ballons_Cogé>1,B21>0),B21,V_Cogé),0.55)/1000","v":19.227101901725938},"valeur ballon de stockage Cogé(à 80°C dans une ambiance de 10°C si non habitable / 20°C sinon)"]
["Unités",170,{"$f":"VLOOKUP(Type_Usage,BASES!A3:C14,3,FALSE)","v":"Nb logements"},"Surface habitable SHAB",12688,null,"Altitude (en m)",50,null,"Qpr Ballon PAC - Par défaut (kWh/24h)",{"$f":"4.2*IF(BallonVH=\"NON\",30,20)*POWER(IF(AND(Nbr_ballons_PAC>1,E21>0),E21,V_PAC),0.55)/1000","v":8.2401865293111172},"valeur ballon de stockage PAC (à 40°C dans une ambiance de 10°C si non habitable / 20°C sinon)"]
["Nb niveaux bat",10]
[]
["ECS",null,null,null,null,null,null,null,null,"Cnn utilisés :","RT2012"]
[null,null,null,null,null,null,null,null,null,null,null,"cnn / 35","cnn Tmax/35"]
["Heures creuses (PAC 2 services)  ?","NON",null,"Ballon en Volume Habitable ?","NON",null,"Nombre d'unité thermodynamiques Nbunités thermo",4,null,{"$f":"INT((TMAX-35)/10)","v":1},{"$f":"35+J14*10","v":45},{"$f":"POWER(Cnn55_45AirEau,J14)","v":0.8},{"$f":"L14+(TMAX-K14)*(L15-L14)/(K15-K14)","v":0.72000000000000008}]
["Réseau distrib collectif","RESEAU BOUCLE",null,null,null,null,null,null,null,{"$f":"J14+1","v":2},{"$f":"35+J15*10","v":55},{"$f":"POWER(Cnn55_45AirEau,J15)","v":0.64000000000000012}]
[]
["Saisie du ou des ballons Cogénération",null,null,"Saisie du ou des ballons PAC"]
["Nombre de ballons",1,null,"Nombre de ballons",1,null,"Si les Qpr ne sont pas renseignés, des valeurs par défaut sont utilisées."]
[null,null,null,null,null,null,"Pour saisir un ballon équivalent, cliquez sur les boutons ci-dessous :"]
["Si ballons identiques",null,null,"Si ballons identiques"]
{"$rows_left_out":58}
{"sheet":"Calcul (EF)","index":1,"n_rows":83,"n_cols":16,"rows_kept":83,"cut":false,"hidden":true,"merged":[[0,6,0,7]]}
["CALCUL DU BESOIN ECS","ah moyen",{"$f":"VLOOKUP(Type_Usage,BASES!A3:D14,4,FALSE)","v":0.14299999999999999},"a",{"$f":"VLOOKUP(Type_Usage,TableUsages,2,FALSE)","v":12.806403614581576},null,"Référence pour besoin ECS",null,{"$f":"IF(ENTREE!B8=\"Logements collectifs\",SHAB,Nbr_lgt)","v":12688}]
[]
[null,"Volume PAC",{"$f":"IF(ENTREE!E21=0,ENTREE!E25,ENTREE!E21*Nbr_ballons_PAC)","v":2000}]
[null,"Qpr PAC",{"$f":"IF(ENTREE!E21=\"\",ENTREE!E26,IF(ENTREE!E22=\"\",Qpr_PAC_défaut*Nbr_ballons_PAC,ENTREE!E22*Nbr_ballons_PAC))","v":8.2401865293111172}]
[null,"Volume Cogé",{"$f":"IF(ENTREE!B21=0,ENTREE!B25,ENTREE!B21*Nbr_ballons_Cogé)","v":2000}]
[null,"Qpr Cogé",{"$f":"IF(ENTREE!B21=0,ENTREE!B26,IF(ENTREE!B22=0,Qpr_Cogé_défaut,ENTREE!B22)*Nbr_ballons_Cogé)","v":19.227101901725938}]
[]
[]
["CALCUL AU PAS MENSUEL","Mois",1,2,3,4,5,6,7,8,9,10,11,12]
[null,"Nb de jours",31,28,31,30,31,30,31,31,30,31,30,31,{"$f":"SUM(C10:N10)","v":365}]
[]
["DONNEES CLIMATIQUES","Température eau froide",{"$f":"VLOOKUP(ZoneSelect,TableTEauFroide,2,0)","v":5.8309677419354804},{"$f":"VLOOKUP(ZoneSelect,TableTEauFroide,3,0)","v":5.8651428571428577},{"$f":"VLOOKUP(ZoneSelect,TableTEauFroide,4,0)","v":7.1909032258064522},{"$f":"VLOOKUP(ZoneSelect,TableTEauFroide,5,0)","v":9.3479333333333354},{"$f":"VLOOKUP(ZoneSelect,TableTEauFroide,6,0)","v":11.866387096774199},{"$f":"VLOOKUP(ZoneSelect,TableTEauFroide,7,0)","v":13.9596},{"$f":"VLOOKUP(ZoneSelect,TableTEauFroide,8,0)","v":15.165290322580651},{"$f":"VLOOKUP(ZoneSelect,TableTEauFroide,9,0)","v":15.101935483870971},{"$f":"VLOOKUP(ZoneSelect,TableTEauFroide,10,0)","v":13.817933333333333},{"$f":"VLOOKUP(ZoneSelect,TableTEauFroide,11,0)","v":11.632193548387098},{"$f":"VLOOKUP(ZoneSelect,TableTEauFroide,12,0)","v":9.1525999999999996},{"$f":"VLOOKUP(ZoneSelect,TableTEauFroide,13,0)","v":7.0303870967741959}]
[null,"Température extérieure",{"$f":"VLOOKUP(ZoneSelect,TableTEXT,2,0)","v":3.9094892473118246},{"$f":"VLOOKUP(ZoneSelect,TableTEXT,3,0)","v":4.44114583333333},{"$f":"VLOOKUP(ZoneSelect,TableTEXT,4,0)","v":7.5451209677419326},{"$f":"VLOOKUP(ZoneSelect,TableTEXT,5,0)","v":9.6573611111110917},{"$f":"VLOOKUP(ZoneSelect,TableTEXT,6,0)","v":13.708239247311861},{"$f":"VLOOKUP(ZoneSelect,TableTEXT,7,0)","v":16.474444444444451},{"$f":"VLOOKUP(ZoneSelect,TableTEXT,8,0)","v":18.980887096774254},{"$f":"VLOOKUP(ZoneSelect,TableTEXT,9,0)","v":19.108642473118319},{"$f":"VLOOKUP(ZoneSelect,TableTEXT,10,0)","v":15.407083333333357},{"$f":"VLOOKUP(ZoneSelect,TableTEXT,11,0)","v":11.976303763440834},{"$f":"VLOOKUP(ZoneSelect,TableTEXT,12,0)","v":6.9559722222222291},{"$f":"VLOOKUP(ZoneSelect,TableTEXT,13,0)","v":4.7526612903225711}]
[null,"qexterieur",{"$f":"IF(Altitude<400,C13,IF(Altitude<800,C13-2,C13-4))","v":3.9094892473118246},4.44114583333333,7.5451209677419326,9.6573611111110917,13.708239247311861,16.474444444444451,18.980887096774254,19.108642473118319,15.407083333333357,11.976303763440834,6.9559722222222291,4.7526612903225711]
["Récup VMC","Tsource_amont",{"$f":"IF(V_AmièsPAC_total>Qvarep,BASES!$B$232*ENTREE!$B$59+(1-ENTREE!$B$59)*C14,BASES!$B$232)","v":17.586423387096772},{"$f":"IF(V_AmièsPAC_total>Qvarep,BASES!$B$232*ENTREE!$B$59+(1-ENTREE!$B$59)*D14,BASES!$B$232)","v":17.666171875},{"$f":"IF(V_AmièsPAC_total>Qvarep,BASES!$B$232*ENTREE!$B$59+(1-ENTREE!$B$59)*E14,BASES!$B$232)","v":18.131768145161288},{"$f":"IF(V_AmièsPAC_total>Qvarep,BASES!$B$232*ENTREE!$B$59+(1-ENTREE!$B$59)*F14,BASES!$B$232)","v":18.448604166666662},{"$f":"IF(V_AmièsPAC_total>Qvarep,BASES!$B$232*ENTREE!$B$59+(1-ENTREE!$B$59)*G14,BASES!$B$232)","v":19.056235887096779},{"$f":"IF(V_AmièsPAC_total>Qvarep,BASES!$B$232*ENTREE!$B$59+(1-ENTREE!$B$59)*H14,BASES!$B$232)","v":19.471166666666669},{"$f":"I14","v":18.980887096774254},19.108642473118319,{"$f":"IF(V_AmièsPAC_total>Qvarep,BASES!$B$232*ENTREE!$B$59+(1-ENTREE!$B$59)*K14,BASES!$B$232)","v":19.311062500000006},{"$f":"IF(V_AmièsPAC_total>Qvarep,BASES!$B$232*ENTREE!$B$59+(1-ENTREE!$B$59)*L14,BASES!$B$232)","v":18.796445564516127},{"$f":"IF(V_AmièsPAC_total>Qvarep,BASES!$B$232*ENTREE!$B$59+(1-ENTREE!$B$59)*M14,BASES!$B$232)","v":18.043395833333335},{"$f":"IF(V_AmièsPAC_total>Qvarep,BASES!$B$232*ENTREE!$B$59+(1-ENTREE!$B$59)*N14,BASES!$B$232)","v":17.712899193548385}]
["Récup Fumées","Besoin mensuel (kWh)",{"$f":"(Ht+Hv)*(20-C14)*C10*24/1000","v":356535.91878238012},311391.96828635014,275977.05301851005,221781.02254190046,139413.76598898927,75599.788848799857,22581.654546538673,19750.832008689122,98487.607053299493,177790.2487809106,279707.90140689985,337852.78785714024]
[null,null,{"$f":"C16/SUM($C$16:$N$16)","v":0.1538868535049305},{"$f":"D16/SUM($C$16:$N$16)","v":0.13440197097095866},0.11911630242927633,9.5724391086976723E-2,6.0173308362833314E-2,3.2630130706914576E-2,9.7466190137863867E-3,8.5247887570531113E-3,4.2508895065669496E-2,7.673723887957748E-2,0.12072659886547826,0.14582290235654508]
[null,"P_enfournée (kW)",{"$f":"C17*C_chauffage*SHON/(24*C10)*PCS_gaz/PCI_gaz","v":290.68049650590183},281.07594120180465,225.00158488834026,186.84325523359843,113.66277724789988,63.690348622203707,18.410617864056306,16.102673958622027,82.972586613128243,144.95077513098212,235.64475541882737,275.44830954370025]
[null,"Volume_gaz_nat (Nm3 PCS)",{"$f":"C18/PCS_gaz","v":25.27656491355668},{"$f":"D18/PCS_gaz","v":24.441386191461273},19.565355207681762,16.247239585530298,9.8837197606869456,5.5382911845394531,1.6009232925266352,1.4002325181410458,7.2150075315763686,12.604415228781054,20.490848297289336,23.952026916843501]
[null,"Chaleur_récupérable (kWh)",{"$f":"C19*(PCS_gaz-PCI_gaz)*Rpn","v":29.573580948861334},28.596421844009704,22.891465592987675,19.009270315070459,11.563952120003734,6.4798006859111634,1.8730802522561643,1.6382720462250244,8.4415588119443559,14.747165817673842,23.974292507828537,28.023871492706913]
{"$rows_left_out":64}
{"sheet":"POST-TRAITEMENT & SORTIE","index":2,"n_rows":23,"n_cols":12,"rows_kept":23,"cut":false,"hidden":false,"merged":[]}
["POST-TRAITEMENT"]
[]
["Mois","Répartition conso [%]","Requis ECS [kWh/m².an]","Besoins ECS / COP [kWh/m².an]","Pertes de stockage ballon PAC à 40°C [kWh/m².an]","Pertes de stockage ballon cogé à 80°C [kWh/m².an]","Pertes de bouclage [kWh/m².an]","Conso EF ECS PAC  [kWhef/m².an]","Conso EF ECS cogé  [kWhef/m².an]","Production élec [kWhef/m².an]","Part cogé","Conso ECS totale [kWhep/m².an]"]
["Janvier",{"$f":"D4/$D$17","v":0.15196060772166406},{"$f":"'Calcul (EF)'!$C27","v":1.9616235151510988},{"$f":"'Calcul (EF)'!$C79","v":0.84657712792604933},{"$f":"'Calcul (EF)'!C$42","v":7.7803905460722663E-3},{"$f":"'Calcul (EF)'!$C43","v":5.4462733822505861E-2},{"$f":"'Calcul (EF)'!C$40","v":0.27462729212115389},{"$f":"D4+E4","v":0.8543575184721216},{"$f":"$I$17*B4+G4","v":4.330869372057359},{"$f":"(C4/ENTREE!$D$63+F4)*ENTREE!$B$65","v":0.83816056287988239},{"$f":"H4/(H4+J4)","v":0.50478486929347921},{"$f":"I4*K4","v":2.1861573299011066}]
["Février",{"$f":"D5/$D$17","v":0.13069191425279467},{"$f":"'Calcul (EF)'!$D27","v":1.7700168770222575},{"$f":"'Calcul (EF)'!$D79","v":0.72808859526240932},{"$f":"'Calcul (EF)'!D$42","v":7.027449525484627E-3},{"$f":"'Calcul (EF)'!$D43","v":4.919214667839239E-2},{"$f":"'Calcul (EF)'!D$40","v":0.2478023627831161},{"$f":"D5+E5","v":0.73511604478789394},{"$f":"$I$17*B5+G5","v":3.7363251454149231},{"$f":"(C5/ENTREE!$D$63+F5)*ENTREE!$B$65","v":0.75630681160841728},{"$f":"H5/(H5+J5)","v":0.49289578849833171},{"$f":"I5*K5","v":1.8416189286354323}]
["Mars",{"$f":"D6/$D$17","v":9.1106806880396615E-2},{"$f":"'Calcul (EF)'!$E$27","v":1.8835504399729139},{"$f":"'Calcul (EF)'!$E$79","v":0.50755876841839986},{"$f":"'Calcul (EF)'!E$42","v":7.7803905460722663E-3},{"$f":"'Calcul (EF)'!$E$43","v":5.4462733822505861E-2},{"$f":"'Calcul (EF)'!E$40","v":0.26369706159620798},{"$f":"D6+E6","v":0.51533915896447213},{"$f":"$I$17*B6+G6","v":2.6955856238857727},{"$f":"(C6/ENTREE!$D$63+F6)*ENTREE!$B$65","v":0.80549521769702126},{"$f":"H6/(H6+J6)","v":0.39016183108970104},{"$f":"I6*K6","v":1.0517146228743472}]
["Avril",7.322194802556016E-2,{"$f":"'Calcul (EF)'!$F$27","v":1.702951590611546},{"$f":"'Calcul (EF)'!$F$79","v":0.40792168042765686},{"$f":"'Calcul (EF)'!F$42","v":7.5294102058763865E-3},{"$f":"'Calcul (EF)'!$F$43","v":5.27058714411347E-2},{"$f":"'Calcul (EF)'!F$40","v":0.23841322268561646},0.41545109063353325,{"$f":"$I$17*B7+G7","v":2.1929062403773099},{"$f":"(C7/ENTREE!$D$63+F7)*ENTREE!$B$65","v":0.72937145661726832},{"$f":"H7/(H7+J7)","v":0.36289562223525851},0.79579607460530521]
["Mai",6.4847691016395301E-2,{"$f":"'Calcul (EF)'!$G$27","v":1.6151337333851716},{"$f":"'Calcul (EF)'!$G$79","v":0.36126844210737691},{"$f":"'Calcul (EF)'!G$42","v":7.7803905460722663E-3},{"$f":"'Calcul (EF)'!$G$43","v":5.4462733822505861E-2},{"$f":"'Calcul (EF)'!G$40","v":0.22611872267392405},0.36904883265344918,1.9570800358136582,{"$f":"(C8/ENTREE!$D$63+F8)*ENTREE!$B$65","v":0.69319114419249417},0.34742510232880486,0.67993873170822128]
["Juin",{"$f":"D9/$D$17","v":5.560308978713166E-2},{"$f":"'Calcul (EF)'!$H$27","v":1.4467390105341751},{"$f":"'Calcul (EF)'!$H$79","v":0.30976648989206013},{"$f":"'Calcul (EF)'!H$42","v":7.5294102058763865E-3},{"$f":"'Calcul (EF)'!$H$43","v":5.27058714411347E-2},{"$f":"'Calcul (EF)'!H$40","v":0.20254346147478453},0.31729590009793651,1.686741214764506,{"$f":"(C9/ENTREE!$D$63+F9)*ENTREE!$B$65","v":0.62217352251107738},0.33773946491709073,0.56967907532816786]
["Juillet",5.2744367003817204E-2,{"$f":"'Calcul (EF)'!$I$27","v":1.4257456906371233},{"$f":"'Calcul (EF)'!$I$79","v":0.29384045906262374},{"$f":"'Calcul (EF)'!I$42","v":7.7803905460722663E-3},{"$f":"'Calcul (EF)'!$I$43","v":5.4462733822505861E-2},{"$f":"'Calcul (EF)'!I$40","v":0.19960439668919727},0.30162084960869601,1.6074950607772784,{"$f":"(C10/ENTREE!$D$63+F10)*ENTREE!$B$65","v":0.61395222891021195},{"$f":"H10/(H10+J10)","v":0.32943394327039188},{"$f":"I10*K10","v":0.52956343665953709}]
["Août",5.2777664613712021E-2,{"$f":"'Calcul (EF)'!$J$27","v":1.4293828536820963},{"$f":"'Calcul (EF)'!$J$79","v":0.29402596105142326},{"$f":"'Calcul (EF)'!J$42","v":7.7803905460722663E-3},{"$f":"'Calcul (EF)'!$J$43","v":5.4462733822505861E-2},{"$f":"'Calcul (EF)'!J$40","v":0.20011359951549348},0.30180635159749553,1.608893067408993,{"$f":"(C11/ENTREE!$D$63+F11)*ENTREE!$B$65","v":0.61547399792058122},0.32902302088566421,0.52936285732090949]
["Septembre",5.6850093591815844E-2,{"$f":"'Calcul (EF)'!$K$27","v":1.454609653579559},{"$f":"'Calcul (EF)'!$K$79","v":0.31671358569083463},{"$f":"'Calcul (EF)'!K$42","v":7.5294102058763865E-3},{"$f":"'Calcul (EF)'!$K$43","v":5.27058714411347E-2},{"$f":"'Calcul (EF)'!K$40","v":0.20364535150113827},0.32424299589671102,1.7211290292303381,{"$f":"(C12/ENTREE!$D$63+F12)*ENTREE!$B$65","v":0.62546655626569481},0.34141279842709593,0.58761547832364069]
["Octobre",6.7292462118796581E-2,{"$f":"'Calcul (EF)'!$L$27","v":1.6285786436226974},{"$f":"'Calcul (EF)'!$L$79","v":0.37488833563990592},{"$f":"'Calcul (EF)'!L$42","v":7.7803905460722663E-3},{"$f":"'Calcul (EF)'!$L$43","v":5.4462733822505861E-2},{"$f":"'Calcul (EF)'!L$40","v":0.22800101010717766},0.38266872618597819,2.0242199157904714,{"$f":"(C13/ENTREE!$D$63+F13)*ENTREE!$B$65","v":0.69881642067685223},0.35383632155838918,0.71624252902853269]
["Novembre",7.7409456398490284E-2,{"$f":"'Calcul (EF)'!$M$27","v":1.7138038184341222},{"$f":"'Calcul (EF)'!$M$79","v":0.43125041584581664},{"$f":"'Calcul (EF)'!M$42","v":7.5294102058763865E-3},{"$f":"'Calcul (EF)'!$M$43","v":5.27058714411347E-2},{"$f":"'Calcul (EF)'!M$40","v":0.23993253458077712},0.43877982605169302,2.3062015442682093,{"$f":"(C14/ENTREE!$D$63+F14)*ENTREE!$B$65","v":0.73391196904128198},0.37416465936551135,0.86289911523933083]
["Décembre",0.12549389858942561,{"$f":"'Calcul (EF)'!$N$27","v":1.8927655740420504},{"$f":"'Calcul (EF)'!$N$79","v":0.69913029325778897},{"$f":"'Calcul (EF)'!N$42","v":7.7803905460722663E-3},{"$f":"'Calcul (EF)'!$N$43","v":5.4462733822505861E-2},{"$f":"'Calcul (EF)'!N$40","v":0.26498718036588709},0.70691068380386124,{"$f":"$I$17*B15+G15","v":3.6147607819958392},{"$f":"(C15/ENTREE!$D$63+F15)*ENTREE!$B$65","v":0.80935077910007447},0.46621951497071601,{"$f":"I15*K15","v":1.6852720185172663}]
[]
["TOTAL",{"$f":"SUM(B4:B15)","v":1},{"$f":"SUM(C4:C15)","v":19.924901400674813},5.5710301545823455,{"$f":"SUM(E4:E15)","v":9.1607824171496044E-2},0.64125476920047231,2.7894861960944741,{"$f":"SUM(H4:H15)","v":5.6626379787538417},{"$f":"ENTREE!D67*ENTREE!D66/(12*ENTREE!D63*SHON)+F17","v":26.692720835690185},{"$f":"SUM(J4:J15)","v":8.541670667420858},null,{"$f":"SUM(L4:L15)","v":12.035860198141798}]
[]
[]
["Résultat"]
{"$rows_left_out":4}
{"sheet":"BASES","index":3,"n_rows":240,"n_cols":26,"rows_kept":240,"cut":false,"hidden":true,"merged":[]}
["Besoins d'eau chaude sanitaire selon le type d'usage"]
[null,"a","Unités","Somme ah journalier sur 7 jours","Durée annuel de fonctionnement de l'ECS dur_ecs","Dur vacances",null,null,null,null,"Coefficients Cnn utilisés"]
["Logements collectifs",{"$f":"IF(SHAB/Nbr_lgt>27,(470.9*LN(SHAB/Nbr_lgt)-1075)/(SHAB/Nbr_lgt),17.7)","v":12.806403614581576},"Nb logements",0.14299999999999999,1820,0,null,null,null,null,"PAC ou CE Thermo Air/Eau",null,null,null,null,null,"PAC ou CE Thermo Air/Eau",null,null,null,null,"Impact sur le COP de la consommation des circulateurs"]
["Hébergements",330,"Nb lits",0.14299999999999999,1820,0,null,null,null,null,"T air extérieur",null,null,"Teau",null,null,"T air extérieur","RT2012","AFPAC",null,null,null,"Sélectionné",null,"Standard","Haute efficacité"]
["Etablissement sanitaires avec hébergement - sans blanchisserie",665,"Nb lits",0.14299999999999999,1820,0,null,null,null,null,"Cnn(2/7)",{"$f":"IF(BaseCnn=\"AFPAC\",BASES!S5,BASES!R5)","v":0.85},null,"Cnn(45/35)",0.8,null,"Cnn(2/7)",0.85,0.8,null,null,"Circuit ECS",{"$f":"IF(EfficaciteCirculateurs=\"Standard\",Y5,Z5)","v":6.0000000000000001E-3},"Circuit ECS",2.4E-2,6.0000000000000001E-3]
["Etablissement sanitaires avec hébergement - avec blanchisserie",1050,"Nb lits",0.14299999999999999,1820,0,null,null,null,null,"Cnn(-7/7)",{"$f":"IF(BaseCnn=\"AFPAC\",BASES!S6,BASES!R6)","v":0.5},null,"Cnn(55/45)",0.8,null,"Cnn(-7/7)",0.5,0.6]
["Hotel 1* sans blanchisserie",665,"Nb chambres",0.14299999999999999,1040,0,null,null,null,null,"Cnn(-15/-7)",{"$f":"IF(BaseCnn=\"AFPAC\",BASES!S7,BASES!R7)","v":0.8},null,"Cnn(65/55)",0.8,null,"Cnn(-15/-7)",0.8,0.8]
["Hotel 1* avec blanchisserie",830,"Nb chambres",0.14299999999999999,1040,0,null,null,null,null,"Cnn(20/7)",{"$f":"IF(BaseCnn=\"AFPAC\",BASES!S8,BASES!R8)","v":1.25},null,"Cnn(25/35)",1.2,null,"Cnn(20/7)",1.25,1.2]
["Hotel 2* sans blanchisserie",910,"Nb chambres",0.14299999999999999,1040,0]
["Hotel 2* avec blanchisserie",1075,"Nb chambres",0.14299999999999999,1040,0]
["Hotel 3* sans blanchisserie",1160,"Nb chambres",0.14299999999999999,1040,0]
["Hotel 3* avec blanchisserie",1325,"Nb chambres",0.14299999999999999,1040,0]
["Hotel 4* sans blanchisserie",1405,"Nb chambres",0.14299999999999999,1040,0]
["Hotel 4* avec blanchisserie",1570,"Nb chambres",0.14299999999999999,1040,0]
[]
[]
[]
["Constantes de calcul"]
["Masse volumique de l'eau :",1]
["Capacité calorifique de l'eau :",{"$f":"1.163/1000","v":1.163E-3}]
{"$rows_left_out":221}
{"sheet":"echangeurs","index":4,"n_rows":30,"n_cols":3,"rows_kept":30,"cut":false,"hidden":true,"merged":[]}
["Pincement Ballon à serpentin"]
[]
["m2/kW","ΔT","equiv echangeur à plaques"]
[0.22,9.5,{"$f":"A4/2","v":0.11}]
[0.23,8.5,{"$f":"A5/2","v":0.115}]
[0.24,7.5,0.12]
[0.25,6.5,0.125]
[0.26,5.5,0.13]
[0.27,4.5,0.13500000000000001]
[0.28000000000000003,3.5,0.14000000000000001]
[0.28999999999999998,2.5,0.14499999999999999]
[0.3,1.5,0.15]
[0.31,0.5,0.155]
[]
[]
["Volume d'échange par m2"]
[60,"l/m2"]
[]
[]
["m2/kW","ΔT"]
{"$rows_left_out":11}
{"sheet":"LISTES","index":5,"n_rows":13,"n_cols":1,"rows_kept":13,"cut":false,"hidden":true,"merged":[]}
["Récupération de chaleur"]
["Aucune"]
["VMC"]
["Fumées de chaudières"]
[]
["Liste_Echangeurs"]
["Ballon à serpentin"]
["Echangeur à plaques"]
["Ballon en bain-marie"]
[]
["Liste"]
["Oui"]
["Non"]

{"sheet":"ConditionsTests","index":6,"n_rows":4,"n_cols":15,"rows_kept":4,"cut":false,"hidden":true,"merged":[]}
["Conditions de tests communes à la EN 255-3 et la pr EN 16147",null,null,null,null,"Conditions de tests communes à la EN 255-3 et la pr EN 16147",null,null,"Calcul des coeff à appliquer au COP nominal HP pour obtenir le COP du maintien en température du ballon avec 5K d'hystérisis"]
[null,null,null,null,null,null,null,null,"COP théo Carnot consigne 50°C",null,null,null,"COP théo Carnot consigne 55°C"]
["Technologie","T source froide","T ambiance ballon",null,null,"Technologie","T source froide",null,"PrEN16147","Hystérisis 5K","Coeff COP",null,"PrEN16147","Hystérisis 5K","Coeff COP"]
["AIR EXTERIEUR/EAU",7,10,null,null,"AIR EXTERIEUR/EAU",7,null,{"$f":"((50+10)/2+273)/((50+10)/2-$B4)","v":13.173913043478262},{"$f":"((50+45)/2+273)/((50+45)/2-$B4)","v":7.9135802469135799},{"$f":"J4/I4","v":0.60070081082182281},null,{"$f":"((55+10)/2+273)/((55+10)/2-$B4)","v":11.980392156862745},{"$f":"((55+50)/2+273)/((55+50)/2-$B4)","v":7.1538461538461542},{"$f":"N4/M4","v":0.59712954802971174}]